Target
Mannose-6-phosphate isomerase
Ligand
BDBM34680
Substrate
Meas. Tech.
HTS identification of compounds inhibiting phosphomannose isomerase (PMI) via a fluorescence intensity assay.
IC50
50000±n/a nM
Citation
 PubChem, PC HTS identification of compounds inhibiting phosphomannose isomerase (PMI) via a fluorescence intensity assay. PubChem Bioassay (2009)[AID] 
Target
Name:
Mannose-6-phosphate isomerase
Synonyms:
MPI MPI_HUMAN PMI1
Type:
PROTEIN
Mol. Mass.:
46651.35
Organism:
Homo sapiens (Human)
Description:
ChEMBL_1448919
Residue:
423
  
Inhibitor
Name:
BDBM34680
Synonyms:
MLS000520914 N-(2-furfuryl)-12-keto-12H-benzo[g]pyrido[2,1-b]quinazoline-4-carboxamide N-(furan-2-ylmethyl)-12-oxo-12H-benzo[g]pyrido[2,1-b]quinazoline-4-carboxamide cid_3507700
Type:
Small organic molecule
Emp. Form.:
C22H15N3O3
Mol. Mass.:
369.3728
SMILES:
O=C(NCc1ccco1)c1cccn2c1nc1cc3ccccc3cc1c2=O
: