Target
Mannose-6-phosphate isomerase
Ligand
BDBM34736
Substrate
Meas. Tech.
HTS identification of compounds inhibiting phosphomannose isomerase (PMI) via a fluorescence intensity assay.
IC50
42448±n/a nM
Citation
 PubChem, PC HTS identification of compounds inhibiting phosphomannose isomerase (PMI) via a fluorescence intensity assay. PubChem Bioassay (2009)[AID] 
Target
Name:
Mannose-6-phosphate isomerase
Synonyms:
MPI MPI_HUMAN PMI1
Type:
PROTEIN
Mol. Mass.:
46651.35
Organism:
Homo sapiens (Human)
Description:
ChEMBL_1448919
Residue:
423
  
Inhibitor
Name:
BDBM34736
Synonyms:
1,4-diketo-3-(4-methoxyphenyl)naphthalene-2-carboxylic acid ethyl ester MLS000573105 cid_790561 ethyl 3-(4-methoxyphenyl)-1,4-dioxo-1,4-dihydro-2-naphthalenecarboxylate | ethyl 3-(4-methoxyphenyl)-1,4-dioxonaphthalene-2-carboxylate
Type:
Small organic molecule
Emp. Form.:
C20H16O5
Mol. Mass.:
336.338
SMILES:
CCOC(=O)C1=C(C(=O)c2ccccc2C1=O)c1ccc(OC)cc1
: