Target
Mannose-6-phosphate isomerase
Ligand
BDBM53616
Substrate
Meas. Tech.
HTS identification of compounds inhibiting phosphomannose isomerase (PMI) via a fluorescence intensity assay.
IC50
50000±n/a nM
Citation
 PubChem, PC HTS identification of compounds inhibiting phosphomannose isomerase (PMI) via a fluorescence intensity assay. PubChem Bioassay (2009)[AID] 
Target
Name:
Mannose-6-phosphate isomerase
Synonyms:
MPI MPI_HUMAN PMI1
Type:
PROTEIN
Mol. Mass.:
46651.35
Organism:
Homo sapiens (Human)
Description:
ChEMBL_1448919
Residue:
423
  
Inhibitor
Name:
BDBM53616
Synonyms:
1-ethyl-2,3,3,5-tetramethyl-3H-indolium 1-ethyl-2,3,3,5-tetramethylindol-1-ium;iodide SMR000311984 | cid_110119
Type:
Small organic molecule
Emp. Form.:
C14H20N
Mol. Mass.:
202.3148
SMILES:
CC[N+]1=C(C)C(C)(C)c2cc(C)ccc12
: