Target
Mannose-6-phosphate isomerase
Ligand
BDBM53634
Substrate
Meas. Tech.
HTS identification of compounds inhibiting phosphomannose isomerase (PMI) via a fluorescence intensity assay.
IC50
50000±n/a nM
Citation
 PubChem, PC HTS identification of compounds inhibiting phosphomannose isomerase (PMI) via a fluorescence intensity assay. PubChem Bioassay (2009)[AID] 
Target
Name:
Mannose-6-phosphate isomerase
Synonyms:
MPI MPI_HUMAN PMI1
Type:
PROTEIN
Mol. Mass.:
46651.35
Organism:
Homo sapiens (Human)
Description:
ChEMBL_1448919
Residue:
423
  
Inhibitor
Name:
BDBM53634
Synonyms:
(6E)-5-azanylidene-6-[[5-(phenylmethylsulfanyl)furan-2-yl]methylidene]-[1,3,4]thiadiazolo[3,2-a]pyrimidin-7-one (6E)-6-[(5-benzylsulfanylfuran-2-yl)methylidene]-5-imino-[1,3,4]thiadiazolo[3,2-a]pyrimidin-7-one (6E)-6-{[5-(benzylthio)-2-furyl]methylene}-5-imino-5,6-dihydro-7H-[1,3,4]thiadiazolo[3,2-a]pyrimidin-7-one SMR000309678 | cid_16194116
Type:
Small organic molecule
Emp. Form.:
C17H12N4O2S2
Mol. Mass.:
368.433
SMILES:
N=C1N2N=CSC2=NC(=O)\C1=C\c1ccc(SCc2ccccc2)o1
: