Target
Mannose-6-phosphate isomerase
Ligand
BDBM48868
Substrate
Meas. Tech.
HTS identification of compounds inhibiting phosphomannose isomerase (PMI) via a fluorescence intensity assay.
IC50
50000±n/a nM
Citation
 PubChem, PC HTS identification of compounds inhibiting phosphomannose isomerase (PMI) via a fluorescence intensity assay. PubChem Bioassay (2009)[AID] 
Target
Name:
Mannose-6-phosphate isomerase
Synonyms:
MPI MPI_HUMAN PMI1
Type:
PROTEIN
Mol. Mass.:
46651.35
Organism:
Homo sapiens (Human)
Description:
ChEMBL_1448919
Residue:
423
  
Inhibitor
Name:
BDBM48868
Synonyms:
1-ethyl-2-[(E)-2-(1H-indol-3-yl)ethenyl]-6-methyl-quinolin-1-ium;iodide 1-ethyl-2-[(E)-2-(1H-indol-3-yl)vinyl]-6-methyl-quinolin-1-ium;iodide MLS000724364 cid_16195322
Type:
Small organic molecule
Emp. Form.:
C22H21N2
Mol. Mass.:
313.415
SMILES:
CC[n+]1c(\C=C\c2c[nH]c3ccccc23)ccc2cc(C)ccc12
: