Target
Mannose-6-phosphate isomerase
Ligand
BDBM52756
Substrate
Meas. Tech.
HTS identification of compounds inhibiting phosphomannose isomerase (PMI) via a fluorescence intensity assay.
IC50
39479±n/a nM
Citation
 PubChem, PC HTS identification of compounds inhibiting phosphomannose isomerase (PMI) via a fluorescence intensity assay. PubChem Bioassay (2009)[AID] 
Target
Name:
Mannose-6-phosphate isomerase
Synonyms:
MPI MPI_HUMAN PMI1
Type:
PROTEIN
Mol. Mass.:
46651.35
Organism:
Homo sapiens (Human)
Description:
ChEMBL_1448919
Residue:
423
  
Inhibitor
Name:
BDBM52756
Synonyms:
2-(2,3-dihydroxy-5-methyl-phenoxy)-5-methyl-resorcinol 5-methyl-2-[5-methyl-2,3-bis(oxidanyl)phenoxy]benzene-1,3-diol SMR000440591 | cid_16196968
Type:
Small organic molecule
Emp. Form.:
C14H14O5
Mol. Mass.:
262.258
SMILES:
Cc1cc(O)c(Oc2cc(C)cc(O)c2O)c(O)c1
: