Target
Nucleotide-binding oligomerization domain-containing protein 2
Ligand
BDBM37016
Substrate
Meas. Tech.
uHTS luminescence assay for the identification of compounds that inhibit NOD2 in MDP treated cells
IC50
2054±n/a nM
Citation
 PubChem, PC uHTS luminescence assay for the identification of compounds that inhibit NOD2 in MDP treated cells PubChem Bioassay (2010)[AID] 
Target
Name:
Nucleotide-binding oligomerization domain-containing protein 2
Synonyms:
CARD15 IBD1 NOD2 Nucleotide-binding oligomerization domain-containing protein 2 | nucleotide-binding oligomerization domain containing 2
Type:
PROTEIN
Mol. Mass.:
115287.18
Organism:
Homo sapiens (Human)
Description:
ChEMBL_1454053
Residue:
1040
  
Inhibitor
Name:
BDBM37016
Synonyms:
MLS000056239 N-[2-[2-[2,5-dimethyl-1-(thiophen-2-ylmethyl)-3-pyrrolyl]-2-oxoethoxy]phenyl]acetamide N-[2-[2-[2,5-dimethyl-1-(thiophen-2-ylmethyl)pyrrol-3-yl]-2-oxoethoxy]phenyl]acetamide cid_2524461
Type:
Small organic molecule
Emp. Form.:
C21H22N2O3S
Mol. Mass.:
382.476
SMILES:
CC(=O)Nc1ccccc1OCC(=O)c1cc(C)n(Cc2cccs2)c1C
: