Target
Nucleotide-binding oligomerization domain-containing protein 2
Ligand
BDBM54326
Substrate
Meas. Tech.
uHTS luminescence assay for the identification of compounds that inhibit NOD2 in MDP treated cells
IC50
2703±n/a nM
Citation
 PubChem, PC uHTS luminescence assay for the identification of compounds that inhibit NOD2 in MDP treated cells PubChem Bioassay (2010)[AID] 
Target
Name:
Nucleotide-binding oligomerization domain-containing protein 2
Synonyms:
CARD15 IBD1 NOD2 Nucleotide-binding oligomerization domain-containing protein 2 | nucleotide-binding oligomerization domain containing 2
Type:
PROTEIN
Mol. Mass.:
115287.18
Organism:
Homo sapiens (Human)
Description:
ChEMBL_1454053
Residue:
1040
  
Inhibitor
Name:
BDBM54326
Synonyms:
3-bromanyl-N-[[(E)-4-phenylbut-3-en-2-ylidene]amino]benzamide 3-bromo-N-[[(E)-4-phenylbut-3-en-2-ylidene]amino]benzamide SMR000289972 | cid_693260
Type:
Small organic molecule
Emp. Form.:
C17H15BrN2O
Mol. Mass.:
343.218
SMILES:
CC(C=Cc1ccccc1)=NNC(=O)c1cccc(Br)c1
: