Target
Cell division control protein 42 homolog
Ligand
BDBM54574
Substrate
Meas. Tech.
Oxadiazole SAR compounds tested by Multiplex dose response to identify specific small molecule inhibitors of Ras and Ras-related GTPases specifically Cdc42 activated mutant
Ki
230±n/a nM
Citation
 PubChem, PC Oxadiazole SAR compounds tested by Multiplex dose response to identify specific small molecule inhibitors of Ras and Ras-related GTPases specifically Cdc42 activated mutant PubChem Bioassay (2009)[AID] 
Target
Name:
Cell division control protein 42 homolog
Synonyms:
CDC42 Cell division control protein 42 homolog cell division cycle 42 (GTP binding protein, 25kDa)
Type:
PROTEIN
Mol. Mass.:
21258.36
Organism:
Homo sapiens (Human)
Description:
ChEMBL_652970
Residue:
191
  
Inhibitor
Name:
BDBM54574
Synonyms:
1-[4-(2,5-dimethylphenyl)-1-piperazinyl]-3-[3-(2-fluorophenyl)-1,2,4-oxadiazol-5-yl]-1-propanone 1-[4-(2,5-dimethylphenyl)piperazino]-3-[3-(2-fluorophenyl)-1,2,4-oxadiazol-5-yl]propan-1-one UNM-0000306118 | cid_42628043
Type:
Small organic molecule
Emp. Form.:
C23H25FN4O2
Mol. Mass.:
408.4686
SMILES:
Cc1ccc(C)c(c1)N1CCN(CC1)C(=O)CCc1nc(no1)-c1ccccc1F
: