Target
Cell division control protein 42 homolog
Ligand
BDBM54615
Substrate
Meas. Tech.
Pyrazoline SAR compounds tested via Multiplex dose response to identify specific small molecule inhibitors of Ras and Ras-related GTPases specifically Cdc42 wildtype protein
EC50
30000±n/a nM
Citation
 PubChem, PC Pyrazoline SAR compounds tested via Multiplex dose response to identify specific small molecule inhibitors of Ras and Ras-related GTPases specifically Cdc42 wildtype protein PubChem Bioassay (2009)[AID] 
Target
Name:
Cell division control protein 42 homolog
Synonyms:
CDC42 Cell division control protein 42 homolog cell division cycle 42 (GTP binding protein, 25kDa)
Type:
PROTEIN
Mol. Mass.:
21258.36
Organism:
Homo sapiens (Human)
Description:
ChEMBL_652970
Residue:
191
  
Inhibitor
Name:
BDBM54615
Synonyms:
2-(2-methylphenyl)-3-(3-nitrophenyl)-5-phenyl-3,4-dihydropyrazole UNM-0000305854 | cid_2865667
Type:
Small organic molecule
Emp. Form.:
C22H19N3O2
Mol. Mass.:
357.4052
SMILES:
Cc1ccccc1[N+]1=N[C-](CC1c1cccc(c1)[N+]([O-])=O)c1ccccc1
: