Target
Cell division control protein 42 homolog
Ligand
BDBM54648
Substrate
Meas. Tech.
Pyrazoline SAR compounds tested via Multiplex dose response to identify specific small molecule inhibitors of Ras and Ras-related GTPases specifically Cdc42 wildtype protein
EC50
5035±n/a nM
Citation
 PubChem, PC Pyrazoline SAR compounds tested via Multiplex dose response to identify specific small molecule inhibitors of Ras and Ras-related GTPases specifically Cdc42 wildtype protein PubChem Bioassay (2009)[AID] 
Target
Name:
Cell division control protein 42 homolog
Synonyms:
CDC42 Cell division control protein 42 homolog cell division cycle 42 (GTP binding protein, 25kDa)
Type:
PROTEIN
Mol. Mass.:
21258.36
Organism:
Homo sapiens (Human)
Description:
ChEMBL_652970
Residue:
191
  
Inhibitor
Name:
BDBM54648
Synonyms:
4-[3-(3-methylphenyl)-5-phenyl-3,4-dihydropyrazol-2-yl]benzenesulfonamide KUC103424N cid_44143700
Type:
Small organic molecule
Emp. Form.:
C22H21N3O2S
Mol. Mass.:
391.486
SMILES:
Cc1cccc(c1)C1CC(=NN1c1ccc(cc1)S(N)(=O)=O)c1ccccc1
: