Target
Cell division control protein 42 homolog
Ligand
BDBM54604
Substrate
Meas. Tech.
Pyrazoline SAR compounds tested via Multiplex dose response to identify specific small molecule inhibitors of Ras and Ras-related GTPases specifically Cdc42 activated mutant
EC50
30000±n/a nM
Citation
 PubChem, PC Pyrazoline SAR compounds tested via Multiplex dose response to identify specific small molecule inhibitors of Ras and Ras-related GTPases specifically Cdc42 activated mutant PubChem Bioassay (2009)[AID] 
Target
Name:
Cell division control protein 42 homolog
Synonyms:
CDC42 Cell division control protein 42 homolog cell division cycle 42 (GTP binding protein, 25kDa)
Type:
PROTEIN
Mol. Mass.:
21258.36
Organism:
Homo sapiens (Human)
Description:
ChEMBL_652970
Residue:
191
  
Inhibitor
Name:
BDBM54604
Synonyms:
3-(4-bromophenyl)-1-phenyl-5-[2-(trifluoromethyl)phenyl]-2-pyrazoline UNM-0000305842 | cid_2854056
Type:
Small organic molecule
Emp. Form.:
C22H16BrF3N2
Mol. Mass.:
445.275
SMILES:
FC(F)(F)c1ccccc1C1CC(=NN1c1ccccc1)c1ccc(Br)cc1
: