Target
Cell division control protein 42 homolog
Ligand
BDBM54610
Substrate
Meas. Tech.
Pyrazoline SAR compounds tested via Multiplex dose response to identify specific small molecule inhibitors of Ras and Ras-related GTPases specifically Cdc42 activated mutant
EC50
30000±n/a nM
Citation
 PubChem, PC Pyrazoline SAR compounds tested via Multiplex dose response to identify specific small molecule inhibitors of Ras and Ras-related GTPases specifically Cdc42 activated mutant PubChem Bioassay (2009)[AID] 
Target
Name:
Cell division control protein 42 homolog
Synonyms:
CDC42 Cell division control protein 42 homolog cell division cycle 42 (GTP binding protein, 25kDa)
Type:
PROTEIN
Mol. Mass.:
21258.36
Organism:
Homo sapiens (Human)
Description:
ChEMBL_652970
Residue:
191
  
Inhibitor
Name:
BDBM54610
Synonyms:
2,3-dimethoxy-6-[5-(4-methoxyphenyl)-2-phenyl-2-pyrazolin-3-yl]benzoic acid UNM-0000305848 | cid_2864207
Type:
Small organic molecule
Emp. Form.:
C25H24N2O5
Mol. Mass.:
432.4685
SMILES:
COc1ccc(cc1)C1=NN(C(C1)c1ccc(OC)c(OC)c1C(O)=O)c1ccccc1
: