Target
Cell division control protein 42 homolog
Ligand
BDBM54622
Substrate
Meas. Tech.
Pyrazoline SAR compounds tested via Multiplex dose response to identify specific small molecule inhibitors of Ras and Ras-related GTPases specifically Cdc42 activated mutant
EC50
31550±n/a nM
Citation
 PubChem, PC Pyrazoline SAR compounds tested via Multiplex dose response to identify specific small molecule inhibitors of Ras and Ras-related GTPases specifically Cdc42 activated mutant PubChem Bioassay (2009)[AID] 
Target
Name:
Cell division control protein 42 homolog
Synonyms:
CDC42 Cell division control protein 42 homolog cell division cycle 42 (GTP binding protein, 25kDa)
Type:
PROTEIN
Mol. Mass.:
21258.36
Organism:
Homo sapiens (Human)
Description:
ChEMBL_652970
Residue:
191
  
Inhibitor
Name:
BDBM54622
Synonyms:
3-(3,4-dimethoxyphenyl)-2-(3-fluorophenyl)-5-(4-fluorophenyl)-3,4-dihydropyrazole UNM-0000305861 | cid_2883119
Type:
Small organic molecule
Emp. Form.:
C23H20F2N2O2
Mol. Mass.:
394.4139
SMILES:
COc1ccc(cc1OC)C1CC(=NN1c1cccc(F)c1)c1ccc(F)cc1
: