Target
Cell division control protein 42 homolog
Ligand
BDBM54662
Substrate
Meas. Tech.
Pyrazoline SAR compounds tested via Multiplex dose response to identify specific small molecule inhibitors of Ras and Ras-related GTPases specifically Cdc42 activated mutant
Ki
260±n/a nM
Citation
 PubChem, PC Pyrazoline SAR compounds tested via Multiplex dose response to identify specific small molecule inhibitors of Ras and Ras-related GTPases specifically Cdc42 activated mutant PubChem Bioassay (2009)[AID] 
Target
Name:
Cell division control protein 42 homolog
Synonyms:
CDC42 Cell division control protein 42 homolog cell division cycle 42 (GTP binding protein, 25kDa)
Type:
PROTEIN
Mol. Mass.:
21258.36
Organism:
Homo sapiens (Human)
Description:
ChEMBL_652970
Residue:
191
  
Inhibitor
Name:
BDBM54662
Synonyms:
4-[3-(4-bromophenyl)-5-phenyl-3,4-dihydropyrazol-2-yl]benzenesulfonamide KUC103443N cid_13927312
Type:
Small organic molecule
Emp. Form.:
C21H18BrN3O2S
Mol. Mass.:
456.356
SMILES:
NS(=O)(=O)c1ccc(cc1)N1N=C(CC1c1ccc(Br)cc1)c1ccccc1
: