Target
Cell division control protein 42 homolog
Ligand
BDBM50218889
Substrate
Meas. Tech.
Additional SAR compounds tested via Multiplex dose response to identify specific small molecule inhibitors of Ras and Ras-related GTPases specifically Cdc42 wildtype
EC50
27±n/a nM
Citation
 PubChem, PC Additional SAR compounds tested via Multiplex dose response to identify specific small molecule inhibitors of Ras and Ras-related GTPases specifically Cdc42 wildtype PubChem Bioassay (2009)[AID] 
Target
Name:
Cell division control protein 42 homolog
Synonyms:
CDC42 Cell division control protein 42 homolog cell division cycle 42 (GTP binding protein, 25kDa)
Type:
PROTEIN
Mol. Mass.:
21258.36
Organism:
Homo sapiens (Human)
Description:
ChEMBL_652970
Residue:
191
  
Inhibitor
Name:
BDBM50218889
Synonyms:
7-chloroindirubin cid_11847137
Type:
Small organic molecule
Emp. Form.:
C16H9ClN2O2
Mol. Mass.:
296.708
SMILES:
Clc1cccc2C(C(=O)Nc12)=C1Nc2ccccc2C1=O
: