Target
Cell division control protein 42 homolog
Ligand
BDBM54704
Substrate
Meas. Tech.
Additional SAR compounds tested via Multiplex dose response to identify specific small molecule inhibitors of Ras and Ras-related GTPases specifically Cdc42 wildtype
EC50
10544±n/a nM
Citation
 PubChem, PC Additional SAR compounds tested via Multiplex dose response to identify specific small molecule inhibitors of Ras and Ras-related GTPases specifically Cdc42 wildtype PubChem Bioassay (2009)[AID] 
Target
Name:
Cell division control protein 42 homolog
Synonyms:
CDC42 Cell division control protein 42 homolog cell division cycle 42 (GTP binding protein, 25kDa)
Type:
PROTEIN
Mol. Mass.:
21258.36
Organism:
Homo sapiens (Human)
Description:
ChEMBL_652970
Residue:
191
  
Inhibitor
Name:
BDBM54704
Synonyms:
UNM-0000306098 sodium;(2S)-2-(6-methoxy-2-naphthalenyl)propanoate sodium;(2S)-2-(6-methoxynaphthalen-2-yl)propanoate
Type:
Small organic molecule
Emp. Form.:
C14H13O3
Mol. Mass.:
229.2518
SMILES:
COc1ccc2cc(ccc2c1)[C@H](C)C([O-])=O
: