Target
Ras-related C3 botulinum toxin substrate 1
Ligand
BDBM54548
Substrate
Meas. Tech.
Oxadiazole SAR compounds tested via Multiplex dose response to identify specific small molecule inhibitors of Ras and Ras-related GTPases specifically Rac1 wildtype
Ki
250±n/a nM
Citation
 PubChem, PC Oxadiazole SAR compounds tested via Multiplex dose response to identify specific small molecule inhibitors of Ras and Ras-related GTPases specifically Rac1 wildtype PubChem Bioassay (2009)[AID] 
Target
Name:
Ras-related C3 botulinum toxin substrate 1
Synonyms:
RAC1_MOUSE Rac1 protein
Type:
PROTEIN
Mol. Mass.:
21455.91
Organism:
Mus musculus
Description:
EBI_101485
Residue:
192
  
Inhibitor
Name:
BDBM54548
Synonyms:
3-[3-(4-methoxyphenyl)-1,2,4-oxadiazol-5-yl]-1-[4-(4-methylphenyl)-1-piperazinyl]-1-propanone 3-[3-(4-methoxyphenyl)-1,2,4-oxadiazol-5-yl]-1-[4-(p-tolyl)piperazino]propan-1-one UNM-0000306069 | cid_25241705
Type:
Small organic molecule
Emp. Form.:
C23H26N4O3
Mol. Mass.:
406.4775
SMILES:
COc1ccc(cc1)-c1noc(CCC(=O)N2CCN(CC2)c2ccc(C)cc2)n1
: