Target
Transient receptor potential M8 protein
Ligand
BDBM267409
Substrate
Meas. Tech.
Canine TRPM8 Functional Assay
Temperature
298.15±n/a K
IC50
5.60±n/a nM
Comments
extracted
Citation
 Player, MRCalvo, RChen, JMeegalla, SParks, DJParsons, WJBallentine, SBranum, S Substituted aza-bicyclic imidazole derivatives useful TRPM8 receptor modulators US Patent  US9718820 Publication Date 8/1/2017 
Target
Name:
Transient receptor potential M8 protein
Synonyms:
Cold-menthol receptor (TRPM8) Transient receptor potential M8 protein Transient receptor potential melastatin subfamily, type 8 (TRPM8)
Type:
Enzyme
Mol. Mass.:
127589.43
Organism:
Canis lupus familiaris (Dog)
Description:
Q1A7N1
Residue:
1104
  
Inhibitor
Name:
BDBM267409
Synonyms:
2-(5-tert-Butyl-4-chloro-2-methyl-2H-pyrazol-3-yl)-4-methoxy-6-(2-trifluoromethyl-phenyl)-3H-imidazo[4,5-c]pyridine | US9718820, Compound 9A
Type:
Small organic molecule
Emp. Form.:
C22H20ClF3N5O
Mol. Mass.:
462.876
SMILES:
COc1nc(cc2nc([n-]c12)-c1c(Cl)c(nn1C)C(C)(C)C)-c1ccccc1C(F)(F)F
: