Target
Ras-related protein Rab-7a
Ligand
BDBM54691
Substrate
Meas. Tech.
Additional SAR compounds tested via Multiplex dose response to identify specific small molecule inhibitors of Ras and Ras-related GTPases specifically Rab7 wildtype
EC50
33189±n/a nM
Citation
 PubChem, PC Additional SAR compounds tested via Multiplex dose response to identify specific small molecule inhibitors of Ras and Ras-related GTPases specifically Rab7 wildtype PubChem Bioassay (2009)[AID] 
Target
Name:
Ras-related protein Rab-7a
Synonyms:
GTP-binding protein (rab7) RAB7A | RAB7A_CANLF
Type:
Enzyme Catalytic Domain
Mol. Mass.:
23519.50
Organism:
Canis lupus familiaris
Description:
gi_164058
Residue:
207
  
Inhibitor
Name:
BDBM54691
Synonyms:
2-amino-5-benzoyl-1-(2,4,6-triisopropylphenyl)sulfonyl-4-(3,4,5-trimethoxyphenyl)pyrrole-3-carbonitrile 2-amino-5-benzoyl-4-(3,4,5-trimethoxyphenyl)-1-[2,4,6-tri(propan-2-yl)phenyl]sulfonylpyrrole-3-carbonitrile UNM-0000305781 | cid_25220932
Type:
Small organic molecule
Emp. Form.:
C36H41N3O6S
Mol. Mass.:
643.792
SMILES:
COc1cc(cc(OC)c1OC)-c1c(C#N)c(N)n(c1C(=O)c1ccccc1)S(=O)(=O)c1c(cc(cc1C(C)C)C(C)C)C(C)C
: