Target
GTPase KRas [1-37]
Ligand
BDBM54687
Substrate
Meas. Tech.
Additional SAR compounds tested via Multiplex dose response to identify specific small molecule inhibitors of Ras and Ras-related GTPases specifically Ras wildtype
EC50
30000±n/a nM
Citation
 PubChem, PC Additional SAR compounds tested via Multiplex dose response to identify specific small molecule inhibitors of Ras and Ras-related GTPases specifically Ras wildtype PubChem Bioassay (2009)[AID] 
Target
Name:
GTPase KRas [1-37]
Synonyms:
ras protein
Type:
Enzyme Catalytic Domain
Mol. Mass.:
4034.04
Organism:
Homo sapiens (Human)
Description:
gi_190938
Residue:
37
  
Inhibitor
Name:
BDBM54687
Synonyms:
2-amino-5-benzoyl-1-butylsulfonyl-4-(3,4,5-trimethoxyphenyl)-3-pyrrolecarbonitrile 2-azanyl-1-butylsulfonyl-5-(phenylcarbonyl)-4-(3,4,5-trimethoxyphenyl)pyrrole-3-carbonitrile cid_25220928
Type:
Small organic molecule
Emp. Form.:
C25H27N3O6S
Mol. Mass.:
497.563
SMILES:
CCCCS(=O)(=O)n1c(N)c(C#N)c(c1C(=O)c1ccccc1)-c1cc(OC)c(OC)c(OC)c1
: