Target
High affinity nerve growth factor receptor
Ligand
BDBM267447
Substrate
Meas. Tech.
TrkA Elisa Enzyme Assay
pH
7.5±n/a
IC50
55±n/a nM
Comments
extracted
Citation
 Andrews, SWCondroski, KRHaas, JJiang, YKolakowski, GRSeo, JYang, HZhao, Q Macrocyclic compounds as Trk kinase inhibitors US Patent  US9718822 Publication Date 8/1/2017 
Target
Name:
High affinity nerve growth factor receptor
Synonyms:
2.7.10.1 NTRK1 NTRK1_HUMAN Neurotrophic tyrosine kinase receptor type 1 Synonyms=MTC TRK1-transforming tyrosine kinase protein TRKA GN Tropomyosin alpha-3 chain/High affinity nerve growth factor receptor Tropomyosin-related kinase A (TrkA) Tyrosine kinase receptor (Trk) Tyrosine kinase receptor A (Trk A) Tyrosine kinase receptor A (TrkA) p140-TrkA
Type:
Mol. Mass.:
87498.18
Organism:
Homo sapiens (Human)
Description:
P04629
Residue:
796
  
Inhibitor
Name:
BDBM267447
Synonyms:
US9718822, 30 US9902741, Example 30
Type:
Small organic molecule
Emp. Form.:
C18H15FN6O4
Mol. Mass.:
398.3479
SMILES:
Fc1cnc2OCCCNC(=O)c3cnn4ccc(nc34)N3[C@H](COC3=O)c2c1
: