Target
Ras-related protein Rab-7a
Ligand
BDBM54653
Substrate
Meas. Tech.
Pyrazoline SAR compounds tested via Multiplex dose response to identify specific small molecule inhibitors of Ras and Ras-related GTPases specifically Rab7 wildtype
EC50
30000±n/a nM
Citation
 PubChem, PC Pyrazoline SAR compounds tested via Multiplex dose response to identify specific small molecule inhibitors of Ras and Ras-related GTPases specifically Rab7 wildtype PubChem Bioassay (2009)[AID] 
Target
Name:
Ras-related protein Rab-7a
Synonyms:
GTP-binding protein (rab7) RAB7A | RAB7A_CANLF
Type:
Enzyme Catalytic Domain
Mol. Mass.:
23519.50
Organism:
Canis lupus familiaris
Description:
gi_164058
Residue:
207
  
Inhibitor
Name:
BDBM54653
Synonyms:
4-[3-(2-methylphenyl)-5-phenyl-3,4-dihydropyrazol-2-yl]benzenesulfonamide KUC103429N cid_44143704
Type:
Small organic molecule
Emp. Form.:
C22H21N3O2S
Mol. Mass.:
391.486
SMILES:
Cc1ccccc1C1CC(=NN1c1ccc(cc1)S(N)(=O)=O)c1ccccc1
: