Target
GTPase KRas [1-37]
Ligand
BDBM48386
Substrate
Meas. Tech.
Oxadiazole SAR compounds tested via Multiplex dose response to identify specific small molecule inhibitors of Ras and Ras-related GTPases specifically Ras activated mutant
EC50
30000±n/a nM
Citation
 PubChem, PC Oxadiazole SAR compounds tested via Multiplex dose response to identify specific small molecule inhibitors of Ras and Ras-related GTPases specifically Ras activated mutant PubChem Bioassay (2009)[AID] 
Target
Name:
GTPase KRas [1-37]
Synonyms:
ras protein
Type:
Enzyme Catalytic Domain
Mol. Mass.:
4034.04
Organism:
Homo sapiens (Human)
Description:
gi_190938
Residue:
37
  
Inhibitor
Name:
BDBM48386
Synonyms:
1-{3-[3-(4-methoxyphenyl)-1,2,4-oxadiazol-5-yl]propanoyl}-4-[3-(trifluoromethyl)phenyl]piperazine 3-[3-(4-methoxyphenyl)-1,2,4-oxadiazol-5-yl]-1-[4-[3-(trifluoromethyl)phenyl]piperazin-1-yl]propan-1-one MLS000091368 cid_3243472
Type:
Small organic molecule
Emp. Form.:
C23H23F3N4O3
Mol. Mass.:
460.4489
SMILES:
COc1ccc(cc1)-c1noc(CCC(=O)N2CCN(CC2)c2cccc(c2)C(F)(F)F)n1
: