Target
Fibroblast growth factor receptor 4
Ligand
BDBM291242
Substrate
Meas. Tech.
FGFR Enzymatic Assay
IC50
<10±n/a nM
Citation
 Lu, LWu, LShen, BYao, W Bicyclic heterocycles as FGFR4 inhibitors US Patent  US10016438 Publication Date 7/10/2018 
Target
Name:
Fibroblast growth factor receptor 4
Synonyms:
CD_antigen: CD334 FGFR4 FGFR4 Fibroblast growth factor receptor JK2 TKF
Type:
Protein
Mol. Mass.:
87957.45
Organism:
Homo sapiens (Human)
Description:
P22455
Residue:
802
  
Inhibitor
Name:
BDBM291242
Synonyms:
N-{3-[2'-(2,6-difluoro-3,5-dimethoxyphenyl)-3'-oxo-2',3'-dihydro-1'H-spiro[cyclopropane-1,4'-[2,7]naphthyridin]-6'-yl]-5-morpholin-4-ylphenyl}acrylamide US9580423, Example 10 | US9801889, Example 10
Type:
Small organic molecule
Emp. Form.:
C31H30F2N4O5
Mol. Mass.:
576.5905
SMILES:
COc1cc(OC)c(F)c(N2Cc3cnc(cc3C3(CC3)C2=O)-c2cc(NC(=O)C=C)cc(c2)N2CCOCC2)c1F
: