Target
Ras-related protein Rab-2A
Ligand
BDBM54603
Substrate
Meas. Tech.
Pyrazoline SAR compounds tested via Multiplex dose response to identify specific small molecule inhibitors of Ras and Ras-related GTPases specifically Rab2 wildtype
EC50
30000±n/a nM
Comments
Extracted from aid = 2045 and tid = 2
Citation
 PubChem, PC Pyrazoline SAR compounds tested via Multiplex dose response to identify specific small molecule inhibitors of Ras and Ras-related GTPases specifically Rab2 wildtype PubChem Bioassay (2016)[AID] 
Target
Name:
Ras-related protein Rab-2A
Synonyms:
RAB2 RAB2A_CANLF | Ras-related protein Rab-2A.
Type:
Enzyme Catalytic Domain
Mol. Mass.:
23545.28
Organism:
Canis lupus familiaris
Description:
gi_46577642
Residue:
212
  
Inhibitor
Name:
BDBM54603
Synonyms:
3-(4-methoxyphenyl)-1-phenyl-5-[2-(trifluoromethyl)phenyl]-2-pyrazoline UNM-0000305841 | cid_2854040
Type:
Small organic molecule
Emp. Form.:
C23H19F3N2O
Mol. Mass.:
396.405
SMILES:
COc1ccc(cc1)C1=NN(C(C1)c1ccccc1C(F)(F)F)c1ccccc1
: