Target
Gamma-aminobutyric acid receptor subunit alpha-5
Ligand
BDBM403740
Substrate
Meas. Tech.
Binding Assay
Ki
0.900±n/a nM
Citation
 Saito, THigashino, MKawaharada, SLewis, AChambers, MSRae, AHirst, KLHartley, CD Fused imidazole compounds US Patent  US10016439 Publication Date 7/10/2018 
Target
Name:
Gamma-aminobutyric acid receptor subunit alpha-5
Synonyms:
GABA receptor alpha-5 subunit GABRA5 Gamma-aminobutyric acid receptor subunit alpha-5 (GABA(A)) | Gamma-aminobutyric acid receptor subunit alpha-5 (GABAA)
Type:
Enzyme
Mol. Mass.:
52160.59
Organism:
Homo sapiens (Human)
Description:
P31644
Residue:
462
  
Inhibitor
Name:
BDBM403740
Synonyms:
6-Chloro-7-((3-(cyclopropylmethyl)-7-methyl-3H-imidazo[4,5-b]pyridin-5-yl)amino)-4-methyl-2H-benzo[b][1,4]oxazin-3(4H)-one | US10016439, 160
Type:
Small organic molecule
Emp. Form.:
C20H20ClN5O2
Mol. Mass.:
397.858
SMILES:
CN1C(=O)COc2cc(Nc3cc(C)c4ncn(CC5CC5)c4n3)c(Cl)cc12
: