Target
Tyrosine-protein kinase BTK
Ligand
BDBM267598
Substrate
Meas. Tech.
Btk Enzyme Activity Assay A
pH
7.2±n/a
Temperature
298.15±n/a K
EC50
<10.00±n/a nM
Comments
extracted
Citation
Target
Name:
Tyrosine-protein kinase BTK
Synonyms:
AGMX1 Agammaglobulinaemia tyrosine kinase B cell progenitor kinase BPK BTK_HUMAN Tyrosine Kinase BTK Tyrosine-protein kinase BTK (BTK)
Type:
Enzyme
Mol. Mass.:
76289.95
Organism:
Homo sapiens (Human)
Description:
Q06187
Residue:
659
  
Inhibitor
Name:
BDBM267598
Synonyms:
4-(8-amino-3-((cis)-1-(2,2-difluorocyclobutanecarbonyl)-6-methylpiperidin-3-yl)imidazo[1,5-a]pyrazin-1-yl)-N-(4-(trifluoromethyl)pyridin-2-yl)benzamide | US9718828, Example, 191
Type:
Small organic molecule
Emp. Form.:
C29H31N7O2
Mol. Mass.:
509.6021
SMILES:
C[C@H]1CC[C@H](CN1C(=O)CC1CC1)c1nc(-c2ccc(cc2)C(=O)Nc2ccccn2)c2c(N)nccn12
: