Target
Tyrosine-protein kinase BTK
Ligand
BDBM267676
Substrate
Meas. Tech.
Btk Enzyme Activity Assay A
pH
7.2±n/a
Temperature
298.15±n/a K
EC50
<10.00±n/a nM
Comments
extracted
Citation
Target
Name:
Tyrosine-protein kinase BTK
Synonyms:
AGMX1 Agammaglobulinaemia tyrosine kinase B cell progenitor kinase BPK BTK_HUMAN Tyrosine Kinase BTK Tyrosine-protein kinase BTK (BTK)
Type:
Enzyme
Mol. Mass.:
76289.95
Organism:
Homo sapiens (Human)
Description:
Q06187
Residue:
659
  
Inhibitor
Name:
BDBM267676
Synonyms:
(R)-4-(4-amino-1-(1-(2,2,2-trifluoroacetyl)piperidin-3-yl)-1H-pyrazolo[3,4-d]pyrimidin-3-yl)-N-(4-(trifluoromethyl)pyridin-2-yl)benzamide | US9718828, Example, 275
Type:
Small organic molecule
Emp. Form.:
C29H31F3N8O4
Mol. Mass.:
612.6028
SMILES:
COCCOCCC(=O)N1CCC[C@H](C1)n1nc(-c2ccc(cc2)C(=O)Nc2cc(ccn2)C(F)(F)F)c2c(N)ncnc12
: