Target
Tyrosine-protein kinase BTK
Ligand
BDBM267699
Substrate
Meas. Tech.
Btk Enzyme Activity Assay A
pH
7.2±n/a
Temperature
298.15±n/a K
EC50
<10.00±n/a nM
Comments
extracted
Citation
Target
Name:
Tyrosine-protein kinase BTK
Synonyms:
AGMX1 Agammaglobulinaemia tyrosine kinase B cell progenitor kinase BPK BTK_HUMAN Tyrosine Kinase BTK Tyrosine-protein kinase BTK (BTK)
Type:
Enzyme
Mol. Mass.:
76289.95
Organism:
Homo sapiens (Human)
Description:
Q06187
Residue:
659
  
Inhibitor
Name:
BDBM267699
Synonyms:
(R)-ethyl 8-amino-3-(1-(3-methyloxetane-3-carbonyl)piperidin-3-yl)-1-(4-(4-(trifluoromethyl)pyridine-2-ylcarbamoyl)phenyl)imidazo[1,5-a]pyrazine-5-carboxylate | US9718828, Example, 300
Type:
Small organic molecule
Emp. Form.:
C30H28F3N7O5
Mol. Mass.:
623.5824
SMILES:
CC1(COC1)C(=O)N1CCC[C@H](C1)c1nc(-c2ccc(cc2)C(=O)Nc2cc(ccn2)C(F)(F)F)c2c(N)ncc(C(O)=O)n12
: