Target
Tyrosine-protein kinase BTK
Ligand
BDBM267706
Substrate
Meas. Tech.
Btk Enzyme Activity Assay A
pH
7.2±n/a
Temperature
298.15±n/a K
EC50
<10.00±n/a nM
Comments
extracted
Citation
Target
Name:
Tyrosine-protein kinase BTK
Synonyms:
AGMX1 Agammaglobulinaemia tyrosine kinase B cell progenitor kinase BPK BTK_HUMAN Tyrosine Kinase BTK Tyrosine-protein kinase BTK (BTK)
Type:
Enzyme
Mol. Mass.:
76289.95
Organism:
Homo sapiens (Human)
Description:
Q06187
Residue:
659
  
Inhibitor
Name:
BDBM267706
Synonyms:
(R)-4-(8-amino-3-(piperidin-3-yl)imidazo[1,5-a]pyrazin-1-yl)-N-(4-(trifluoromethyl) pyridin-2-yl)benzamide | US9718828, Example, 308
Type:
Small organic molecule
Emp. Form.:
C31H32F3N7O3
Mol. Mass.:
607.6261
SMILES:
CCc1cnc(N)c2c(nc([C@@H]3CCCN(C3)C(=O)C3(C)COC3)n12)-c1ccc(cc1)C(=O)Nc1cc(ccn1)C(F)(F)F
: