Target
GTPase KRas [1-37]
Ligand
BDBM54613
Substrate
Meas. Tech.
Pyrazoline SAR compounds tested via Multiplex dose response to identify specific small molecule inhibitors of Ras and Ras-related GTPases specifically Ras wildtype
EC50
30000±n/a nM
Citation
 PubChem, PC Pyrazoline SAR compounds tested via Multiplex dose response to identify specific small molecule inhibitors of Ras and Ras-related GTPases specifically Ras wildtype PubChem Bioassay (2009)[AID] 
Target
Name:
GTPase KRas [1-37]
Synonyms:
ras protein
Type:
Enzyme Catalytic Domain
Mol. Mass.:
4034.04
Organism:
Homo sapiens (Human)
Description:
gi_190938
Residue:
37
  
Inhibitor
Name:
BDBM54613
Synonyms:
3-(4-methoxyphenyl)-2-(4-nitrophenyl)-5-phenyl-3,4-dihydropyrazole UNM-0000305852 | cid_2865225
Type:
Small organic molecule
Emp. Form.:
C22H19N3O3
Mol. Mass.:
373.4046
SMILES:
COc1ccc(cc1)C1C[C-](N=[N+]1c1ccc(cc1)[N+]([O-])=O)c1ccccc1
: