Target
GTPase KRas [1-37]
Ligand
BDBM54629
Substrate
Meas. Tech.
Pyrazoline SAR compounds tested via Multiplex dose response to identify specific small molecule inhibitors of Ras and Ras-related GTPases specifically Ras wildtype
EC50
1026±n/a nM
Citation
 PubChem, PC Pyrazoline SAR compounds tested via Multiplex dose response to identify specific small molecule inhibitors of Ras and Ras-related GTPases specifically Ras wildtype PubChem Bioassay (2009)[AID] 
Target
Name:
GTPase KRas [1-37]
Synonyms:
ras protein
Type:
Enzyme Catalytic Domain
Mol. Mass.:
4034.04
Organism:
Homo sapiens (Human)
Description:
gi_190938
Residue:
37
  
Inhibitor
Name:
BDBM54629
Synonyms:
2-chloranyl-5-[3-(4-methoxyphenyl)-5-phenyl-3,4-dihydropyrazol-2-yl]benzoic acid 2-chloro-5-[5-(4-methoxyphenyl)-3-phenyl-2-pyrazolin-1-yl]benzoic acid cid_2951170
Type:
Small organic molecule
Emp. Form.:
C23H19ClN2O3
Mol. Mass.:
406.862
SMILES:
COc1ccc(cc1)C1CC(=NN1c1ccc(Cl)c(c1)C(O)=O)c1ccccc1
: