Target
Ras-related C3 botulinum toxin substrate 1
Ligand
BDBM54592
Substrate
Meas. Tech.
Pyrazoline SAR compounds tested via Multiplex dose response to identify specific small molecule inhibitors of Ras and Ras-related GTPases specifically Rac1 activated mutant
EC50
30000±n/a nM
Citation
 PubChem, PC Pyrazoline SAR compounds tested via Multiplex dose response to identify specific small molecule inhibitors of Ras and Ras-related GTPases specifically Rac1 activated mutant PubChem Bioassay (2009)[AID] 
Target
Name:
Ras-related C3 botulinum toxin substrate 1
Synonyms:
RAC1_MOUSE Rac1 protein
Type:
PROTEIN
Mol. Mass.:
21455.91
Organism:
Mus musculus
Description:
EBI_101485
Residue:
192
  
Inhibitor
Name:
BDBM54592
Synonyms:
1-(3,4-dichlorophenyl)-3,5-bis(4-methoxyphenyl)-2-pyrazoline UNM-0000305830 | cid_2829399
Type:
Small organic molecule
Emp. Form.:
C23H20Cl2N2O2
Mol. Mass.:
427.323
SMILES:
COc1ccc(cc1)C1CC(=NN1c1ccc(Cl)c(Cl)c1)c1ccc(OC)cc1
: