Target
Ras-related C3 botulinum toxin substrate 1
Ligand
BDBM54622
Substrate
Meas. Tech.
Pyrazoline SAR compounds tested via Multiplex dose response to identify specific small molecule inhibitors of Ras and Ras-related GTPases specifically Rac1 activated mutant
Ki
3030±n/a nM
Citation
 PubChem, PC Pyrazoline SAR compounds tested via Multiplex dose response to identify specific small molecule inhibitors of Ras and Ras-related GTPases specifically Rac1 activated mutant PubChem Bioassay (2009)[AID] 
Target
Name:
Ras-related C3 botulinum toxin substrate 1
Synonyms:
RAC1_MOUSE Rac1 protein
Type:
PROTEIN
Mol. Mass.:
21455.91
Organism:
Mus musculus
Description:
EBI_101485
Residue:
192
  
Inhibitor
Name:
BDBM54622
Synonyms:
3-(3,4-dimethoxyphenyl)-2-(3-fluorophenyl)-5-(4-fluorophenyl)-3,4-dihydropyrazole UNM-0000305861 | cid_2883119
Type:
Small organic molecule
Emp. Form.:
C23H20F2N2O2
Mol. Mass.:
394.4139
SMILES:
COc1ccc(cc1OC)C1CC(=NN1c1cccc(F)c1)c1ccc(F)cc1
: