Target
Ras-related C3 botulinum toxin substrate 1
Ligand
BDBM54563
Substrate
Meas. Tech.
Oxadiazole SAR compounds tested via Multiplex dose response to identify specific small molecule inhibitors of Ras and Ras-related GTPases specifically Rac1 activated mutant
Ki
300±n/a nM
Citation
 PubChem, PC Oxadiazole SAR compounds tested via Multiplex dose response to identify specific small molecule inhibitors of Ras and Ras-related GTPases specifically Rac1 activated mutant PubChem Bioassay (2009)[AID] 
Target
Name:
Ras-related C3 botulinum toxin substrate 1
Synonyms:
RAC1_MOUSE Rac1 protein
Type:
PROTEIN
Mol. Mass.:
21455.91
Organism:
Mus musculus
Description:
EBI_101485
Residue:
192
  
Inhibitor
Name:
BDBM54563
Synonyms:
1-[4-(2,5-dimethylphenyl)-1-piperazinyl]-3-[3-(4-methylphenyl)-1,2,4-oxadiazol-5-yl]-1-propanone 1-[4-(2,5-dimethylphenyl)piperazino]-3-[3-(p-tolyl)-1,2,4-oxadiazol-5-yl]propan-1-one UNM-0000306084 | cid_22431081
Type:
Small organic molecule
Emp. Form.:
C24H28N4O2
Mol. Mass.:
404.5047
SMILES:
Cc1ccc(cc1)-c1noc(CCC(=O)N2CCN(CC2)c2cc(C)ccc2C)n1
: