Target
Orexin receptor type 2
Ligand
BDBM101893
Substrate
Meas. Tech.
FLIPR Ca2+ Flux Assay
Temperature
310.15±n/a K
IC50
27±n/a nM
Comments
extracted
Citation
 Liverton, NBeshore, DCKuduk, SDLuo, YMeng, NYu, T Thiazole orexin receptor antagonists US Patent  US9695163 Publication Date 7/4/2017 
Target
Name:
Orexin receptor type 2
Synonyms:
HCRTR2 OX2R_HUMAN Orexin receptor type 2 (OR-2) Orexin receptor type 2 (OX2R) Ox-2-R | Ox2-R
Type:
Protein
Mol. Mass.:
50710.53
Organism:
Homo sapiens (Human)
Description:
O43614
Residue:
444
  
Inhibitor
Name:
BDBM101893
Synonyms:
US9695163, 23
Type:
Small organic molecule
Emp. Form.:
C24H28N4O2S
Mol. Mass.:
436.57
SMILES:
C[C@@H]1CC[C@H](CN1C(=O)c1ccccc1-c1ncccn1)c1nc(c(C)s1)C(C)(C)O
: