Target
Orexin/Hypocretin receptor type 1
Ligand
BDBM102017
Substrate
Meas. Tech.
FLIPR Ca2+ Flux Assay
Temperature
310.15±n/a K
IC50
7200±n/a nM
Comments
extracted
Citation
 Liverton, NBeshore, DCKuduk, SDLuo, YMeng, NYu, T Thiazole orexin receptor antagonists US Patent  US9695163 Publication Date 7/4/2017 
Target
Name:
Orexin/Hypocretin receptor type 1
Synonyms:
HCRTR1 OX1R_HUMAN Orexin receptor type 1 (OR 1) Orexin receptor type 1 (OX1) Orexin receptor type 1 (OxR1) | Ox1r
Type:
Protein
Mol. Mass.:
47554.50
Organism:
Homo sapiens (Human)
Description:
O43613
Residue:
425
  
Inhibitor
Name:
BDBM102017
Synonyms:
US9695163, 37
Type:
Small organic molecule
Emp. Form.:
C19H23N5O2S2
Mol. Mass.:
417.548
SMILES:
C[C@@H]1CC[C@H](CN1C(=O)c1ccsc1-n1nccn1)c1csc(n1)C(C)(C)O
: