Target
Ras-related C3 botulinum toxin substrate 1
Ligand
BDBM54601
Substrate
Meas. Tech.
Pyrazoline SAR compounds tested via Multiplex dose response to identify specific small molecule inhibitors of Ras and Ras-related GTPases specifically Rac1 wildtype
EC50
5649±n/a nM
Citation
 PubChem, PC Pyrazoline SAR compounds tested via Multiplex dose response to identify specific small molecule inhibitors of Ras and Ras-related GTPases specifically Rac1 wildtype PubChem Bioassay (2009)[AID] 
Target
Name:
Ras-related C3 botulinum toxin substrate 1
Synonyms:
RAC1_MOUSE Rac1 protein
Type:
PROTEIN
Mol. Mass.:
21455.91
Organism:
Mus musculus
Description:
EBI_101485
Residue:
192
  
Inhibitor
Name:
BDBM54601
Synonyms:
UNM-0000305839 [4-(2,3-diphenyl-3,4-dihydropyrazol-5-yl)phenyl] ethanoate acetic acid [4-(2,3-diphenyl-3,4-dihydropyrazol-5-yl)phenyl] ester | cid_2849108
Type:
Small organic molecule
Emp. Form.:
C23H20N2O2
Mol. Mass.:
356.4171
SMILES:
CC(=O)Oc1ccc(cc1)C1=NN(C(C1)c1ccccc1)c1ccccc1
: