Target
Tyrosine-protein phosphatase non-receptor type 7
Ligand
BDBM46184
Substrate
Meas. Tech.
MOA HePTP Fluorescent secondary assay for identification of redox-state modulating compounds
IC50
693±n/a nM
Citation
 PubChem, PC MOA HePTP Fluorescent secondary assay for identification of redox-state modulating compounds PubChem Bioassay (2009)[AID] 
Target
Name:
Tyrosine-protein phosphatase non-receptor type 7
Synonyms:
He-PTP Hematopoietic protein-tyrosine phosphatase (HEPTP) PTPN7 Tyrosine-protein phosphatase non-receptor type 7 | Tyrosine-protein phosphatase non-receptor type 7 (HEPTP)
Type:
Protein
Mol. Mass.:
40530.79
Organism:
Homo sapiens (Human)
Description:
P35236
Residue:
360
  
Inhibitor
Name:
BDBM46184
Synonyms:
MLS-0202048.0001 N-[2,3-bis(2-furyl)quinoxalin-6-yl]morpholine-4-carboxamide cid_1072900
Type:
Small organic molecule
Emp. Form.:
C21H18N4O4
Mol. Mass.:
390.392
SMILES:
O=C(Nc1ccc2nc(-c3ccco3)c(nc2c1)-c1ccco1)N1CCOCC1
: