Target
Tyrosine-protein phosphatase non-receptor type 7
Ligand
BDBM46192
Substrate
Meas. Tech.
MOA HePTP Fluorescent secondary assay for identification of redox-state modulating compounds
IC50
472±n/a nM
Citation
 PubChem, PC MOA HePTP Fluorescent secondary assay for identification of redox-state modulating compounds PubChem Bioassay (2009)[AID] 
Target
Name:
Tyrosine-protein phosphatase non-receptor type 7
Synonyms:
He-PTP Hematopoietic protein-tyrosine phosphatase (HEPTP) PTPN7 Tyrosine-protein phosphatase non-receptor type 7 | Tyrosine-protein phosphatase non-receptor type 7 (HEPTP)
Type:
Protein
Mol. Mass.:
40530.79
Organism:
Homo sapiens (Human)
Description:
P35236
Residue:
360
  
Inhibitor
Name:
BDBM46192
Synonyms:
1-[2,3-bis(2-furanyl)-6-quinoxalinyl]-3-(2-phenylethyl)urea 1-[2,3-bis(furan-2-yl)quinoxalin-6-yl]-3-(2-phenylethyl)urea cid_24178226
Type:
Small organic molecule
Emp. Form.:
C25H20N4O3
Mol. Mass.:
424.4513
SMILES:
O=C(NCCc1ccccc1)Nc1ccc2nc(-c3ccco3)c(nc2c1)-c1ccco1
: