Target
Tyrosine-protein phosphatase non-receptor type 7
Ligand
BDBM46226
Substrate
Meas. Tech.
MOA HePTP Fluorescent secondary assay for identification of redox-state modulating compounds
IC50
209±n/a nM
Citation
 PubChem, PC MOA HePTP Fluorescent secondary assay for identification of redox-state modulating compounds PubChem Bioassay (2009)[AID] 
Target
Name:
Tyrosine-protein phosphatase non-receptor type 7
Synonyms:
He-PTP Hematopoietic protein-tyrosine phosphatase (HEPTP) PTPN7 Tyrosine-protein phosphatase non-receptor type 7 | Tyrosine-protein phosphatase non-receptor type 7 (HEPTP)
Type:
Protein
Mol. Mass.:
40530.79
Organism:
Homo sapiens (Human)
Description:
P35236
Residue:
360
  
Inhibitor
Name:
BDBM46226
Synonyms:
MLS-0266887.0001 | cid_2545524
Type:
Small organic molecule
Emp. Form.:
C25H22N2O8S2
Mol. Mass.:
542.581
SMILES:
CCOC(=O)c1sc2nc3c(SCCC(O)=O)cc(cn3c(=O)c2c1C)C(=O)c1cc(OC)ccc1O
: