Target
Tyrosine-protein phosphatase non-receptor type 7
Ligand
BDBM46231
Substrate
Meas. Tech.
MOA HePTP Fluorescent secondary assay for identification of redox-state modulating compounds
IC50
100000±n/a nM
Citation
 PubChem, PC MOA HePTP Fluorescent secondary assay for identification of redox-state modulating compounds PubChem Bioassay (2009)[AID] 
Target
Name:
Tyrosine-protein phosphatase non-receptor type 7
Synonyms:
He-PTP Hematopoietic protein-tyrosine phosphatase (HEPTP) PTPN7 Tyrosine-protein phosphatase non-receptor type 7 | Tyrosine-protein phosphatase non-receptor type 7 (HEPTP)
Type:
Protein
Mol. Mass.:
40530.79
Organism:
Homo sapiens (Human)
Description:
P35236
Residue:
360
  
Inhibitor
Name:
BDBM46231
Synonyms:
3-sulfamoyl-N-thiochroman-4-yl-benzamide N-(3,4-dihydro-2H-1-benzothiopyran-4-yl)-3-sulfamoylbenzamide N-(3,4-dihydro-2H-thiochromen-4-yl)-3-sulfamoylbenzamide | cid_16326652
Type:
Small organic molecule
Emp. Form.:
C16H16N2O3S2
Mol. Mass.:
348.44
SMILES:
NS(=O)(=O)c1cccc(c1)C(=O)NC1CCSc2ccccc12
: