Target
Tyrosine-protein phosphatase non-receptor type 7
Ligand
BDBM46252
Substrate
Meas. Tech.
MOA HePTP Fluorescent secondary assay for identification of redox-state modulating compounds
IC50
665±n/a nM
Citation
 PubChem, PC MOA HePTP Fluorescent secondary assay for identification of redox-state modulating compounds PubChem Bioassay (2009)[AID] 
Target
Name:
Tyrosine-protein phosphatase non-receptor type 7
Synonyms:
He-PTP Hematopoietic protein-tyrosine phosphatase (HEPTP) PTPN7 Tyrosine-protein phosphatase non-receptor type 7 | Tyrosine-protein phosphatase non-receptor type 7 (HEPTP)
Type:
Protein
Mol. Mass.:
40530.79
Organism:
Homo sapiens (Human)
Description:
P35236
Residue:
360
  
Inhibitor
Name:
BDBM46252
Synonyms:
(4E)-2-methoxy-4-[[(phenylmethyl)amino]-sulfanyl-methylidene]cyclohexa-2,5-dien-1-one (4E)-4-[(benzylamino)-sulfanylmethylidene]-2-methoxycyclohexa-2,5-dien-1-one MLS-0412121.0001 | cid_20110352
Type:
Small organic molecule
Emp. Form.:
C15H15NO2S
Mol. Mass.:
273.35
SMILES:
COc1cc(ccc1O)C(=S)NCc1ccccc1
: