Target
Tyrosine-protein phosphatase non-receptor type 7
Ligand
BDBM46281
Substrate
Meas. Tech.
MOA HePTP Fluorescent secondary assay for identification of redox-state modulating compounds
IC50
1070±n/a nM
Citation
 PubChem, PC MOA HePTP Fluorescent secondary assay for identification of redox-state modulating compounds PubChem Bioassay (2009)[AID] 
Target
Name:
Tyrosine-protein phosphatase non-receptor type 7
Synonyms:
He-PTP Hematopoietic protein-tyrosine phosphatase (HEPTP) PTPN7 Tyrosine-protein phosphatase non-receptor type 7 | Tyrosine-protein phosphatase non-receptor type 7 (HEPTP)
Type:
Protein
Mol. Mass.:
40530.79
Organism:
Homo sapiens (Human)
Description:
P35236
Residue:
360
  
Inhibitor
Name:
BDBM46281
Synonyms:
2-[4-[(Z)-[2-(4-fluoroanilino)-4-keto-2-thiazolin-5-ylidene]methyl]phenoxy]acetic acid methyl ester MLS-0425606.0001 methyl 2-[4-[(Z)-[2-(4-fluoroanilino)-4-oxo-1,3-thiazol-5-ylidene]methyl]phenoxy]acetate | methyl 2-[4-[(Z)-[2-[(4-fluorophenyl)amino]-4-oxidanylidene-1,3-thiazol-5-ylidene]methyl]phenoxy]ethanoate
Type:
Small organic molecule
Emp. Form.:
C19H15FN2O4S
Mol. Mass.:
386.397
SMILES:
COC(=O)COc1ccc(C=C2SC(Nc3ccc(F)cc3)=NC2=O)cc1
: