Target
Dual specificity protein phosphatase 3
Ligand
BDBM46252
Substrate
Meas. Tech.
MOA VHR1 Fluorescent secondary assay for identification of redox-state modulating compounds
IC50
1430±n/a nM
Citation
 PubChem, PC MOA VHR1 Fluorescent secondary assay for identification of redox-state modulating compounds PubChem Bioassay (2009)[AID] 
Target
Name:
Dual specificity protein phosphatase 3
Synonyms:
DUS3_HUMAN Dual specificity protein phosphatase (VHR) Dual specificity protein phosphatase VHR Tyrosine-protein phosphatase non-receptor type 1 | VHR
Type:
Hydrolase
Mol. Mass.:
20480.58
Organism:
Homo sapiens (Human)
Description:
Residue:
185
  
Inhibitor
Name:
BDBM46252
Synonyms:
(4E)-2-methoxy-4-[[(phenylmethyl)amino]-sulfanyl-methylidene]cyclohexa-2,5-dien-1-one (4E)-4-[(benzylamino)-sulfanylmethylidene]-2-methoxycyclohexa-2,5-dien-1-one MLS-0412121.0001 | cid_20110352
Type:
Small organic molecule
Emp. Form.:
C15H15NO2S
Mol. Mass.:
273.35
SMILES:
COc1cc(ccc1O)C(=S)NCc1ccccc1
: