Target
Apoptosis regulator Bcl-2
Ligand
BDBM33200
Substrate
Meas. Tech.
Confirmation dose response of hits from multiplexed high-throughput screen for small molecule regulators of Bcl-2 family protein interactions, specifically Bim-Bcl-2
EC50
29460±n/a nM
Citation
 PubChem, PC Confirmation dose response of hits from multiplexed high-throughput screen for small molecule regulators of Bcl-2 family protein interactions, specifically Bim-Bcl-2 PubChem Bioassay (2009)[AID] 
Target
Name:
Apoptosis regulator Bcl-2
Synonyms:
Apoptosis regulator Bcl-2 Protein BCL-2 BCL2_HUMAN | Bcl-2 Protein
Type:
Homodimer or heterodimer
Mol. Mass.:
26269.11
Organism:
Homo sapiens (Human)
Description:
P10415
Residue:
239
  
Inhibitor
Name:
BDBM33200
Synonyms:
2-(2-furanyl)-4-quinolinecarboxylic acid [2-(diethylamino)-2-oxoethyl] ester MLS000772521 [2-(diethylamino)-2-oxidanylidene-ethyl] 2-(furan-2-yl)quinoline-4-carboxylate cid_2096417
Type:
Small organic molecule
Emp. Form.:
C20H20N2O4
Mol. Mass.:
352.3838
SMILES:
CCN(CC)C(=O)COC(=O)c1cc(nc2ccccc12)-c1ccco1
: