Target
Bcl-2-like protein 10 [11-204]
Ligand
BDBM46302
Substrate
Meas. Tech.
Confirmation dose response of hits from multiplexed high-throughput screen for small molecule regulators of Bcl-2 family protein interactions, specifically Bim-Bcl-B
EC50
6400±n/a nM
Citation
 PubChem, PC Confirmation dose response of hits from multiplexed high-throughput screen for small molecule regulators of Bcl-2 family protein interactions, specifically Bim-Bcl-B PubChem Bioassay (2009)[AID] 
Target
Name:
Bcl-2-like protein 10 [11-204]
Synonyms:
Apoptosis regulator Bcl-B (Bcl-2-like 10 protein) (Bcl2-L-10) (Anti-apoptotic protein NrH). BCL-B BCLB DIVA
Type:
Enzyme Catalytic Domain
Mol. Mass.:
21981.77
Organism:
Homo sapiens (Human)
Description:
gi_23396469
Residue:
194
  
Inhibitor
Name:
BDBM46302
Synonyms:
MLS000083668 cid_666339
Type:
Small organic molecule
Emp. Form.:
C26H25N5O4
Mol. Mass.:
471.5078
SMILES:
O=C1NC(=O)C2(Cc3c(nc4ccccn4c3=O)N3CCCCCC23)C(=O)N1Cc1ccccc1
: