Target
Induced myeloid leukemia cell differentiation protein Mcl-1
Ligand
BDBM43203
Substrate
Meas. Tech.
Confirmation dose response of hits from multiplexed high-throughput screen for small molecule regulators of Bcl-2 family protein interactions, specifically Bim-Mcl-1
EC50
7750±n/a nM
Citation
 PubChem, PC Confirmation dose response of hits from multiplexed high-throughput screen for small molecule regulators of Bcl-2 family protein interactions, specifically Bim-Mcl-1 PubChem Bioassay (2009)[AID] 
Target
Name:
Induced myeloid leukemia cell differentiation protein Mcl-1
Synonyms:
BCL2L3 Bcl-2-like protein 3 (Mcl-1) Bcl2-L-3 MCL1 Mcl-1 Myeloid cell leukemia sequence 1 (BCL2-related) | mcl1/EAT
Type:
Membrane; Single-pass membrane protein
Mol. Mass.:
37332.87
Organism:
Homo sapiens (Human)
Description:
Q07820
Residue:
350
  
Inhibitor
Name:
BDBM43203
Synonyms:
2-[[5-(4-chlorophenyl)-4-phenyl-1,2,4-triazol-3-yl]sulfanyl]-N-[(5-methylfuran-2-yl)methylideneamino]acetamide 2-[[5-(4-chlorophenyl)-4-phenyl-1,2,4-triazol-3-yl]thio]-N-[(5-methyl-2-furanyl)methylideneamino]acetamide MLS000594909 [5-(4-Chloro-phenyl)-4-phenyl-4H-[1,2,4]triazol-3-ylsulfanyl]-acetic acid [1-(5-methyl-furan-2-yl)-meth-(E)-ylidene]-hydrazide | cid_1243212
Type:
Small organic molecule
Emp. Form.:
C22H18ClN5O2S
Mol. Mass.:
451.929
SMILES:
Cc1ccc(C=NNC(=O)CSc2nnc(-c3ccc(Cl)cc3)n2-c2ccccc2)o1
: