Target
Amyloid-beta A4 precursor protein-binding family A member 1
Ligand
BDBM34295
Substrate
Meas. Tech.
uHTS Homogeneous Terbium Time-Resolved Fluorescence Resonance Energy Transfer (HTRF) Assay
IC50
22300±n/a nM
Citation
 PubChem, PC uHTS Homogeneous Terbium Time-Resolved Fluorescence Resonance Energy Transfer (HTRF) Assay PubChem Bioassay (2009)[AID] 
Target
Name:
Amyloid-beta A4 precursor protein-binding family A member 1
Synonyms:
APBA1_RAT Mint1 neuronal munc18-1 binding protein
Type:
Enzyme Catalytic Domain
Mol. Mass.:
92603.32
Organism:
Rattus norvegicus
Description:
gi_2625023
Residue:
839
  
Inhibitor
Name:
BDBM34295
Synonyms:
6-keto-8-(5-methyl-2-furyl)-3-(m-tolyl)-2,4,7,8-tetrahydropyrido[2,1-b][1,3,5]thiadiazine-9-carbonitrile 8-(5-methylfuran-2-yl)-3-(3-methylphenyl)-6-oxidanylidene-2,4,7,8-tetrahydropyrido[2,1-b][1,3,5]thiadiazine-9-carbonitrile MLS000080648 cid_666162
Type:
Small organic molecule
Emp. Form.:
C20H19N3O2S
Mol. Mass.:
365.449
SMILES:
Cc1ccc(o1)C1CC(=O)N2CN(CSC2=C1C#N)c1cccc(C)c1
: